Punto informatico Network
Login Esegui login | Non sei registrato? Iscriviti ora (è gratuito!)
Username: Password:
  • Annuncio Pubblicitario

installazione kernel 2.4.9

Il forum riservato agli amici del Pinguino e al software libero.

installazione kernel 2.4.9

Messaggioda vader » sab dic 22, 2007 2:13 pm

dovrei installre il kernel in oggetto sulla mia kubuntu gutsy gibbon(....non chiedetemi il perché Angry )
ho provato con questa guida:
http://whitepenguin.wordpress.com/2007/ ... eisty-704/
ma quando arrivo qui: fakeroot make-kpkg –initrd –append-to-version=-custom kernel_image kernel_headers
mi termina così:
make[1]: *** [init/main.o] Error 1
make[1]: Leaving directory `/usr/src/linux'
make: *** [debian/stamp-build-kernel] Error 2

riporto tutto per completezza
Codice: Seleziona tutto

make[1]: Entering directory `/usr/src/linux'
gcc -D__KERNEL__ -I/usr/src/linux/include -Wall -Wstrict-prototypes -Wno-trigraphs -O2 -fomit-frame-pointer -fno-strict-aliasing -fno-common -pipe -mpreferred-stack-boundary=2 -march=i586   -c -o init/main.o init/main.c
In file included from /usr/src/linux/include/linux/wait.h:19,
                 from /usr/src/linux/include/linux/fs.h:12,
                 from /usr/src/linux/include/linux/capability.h:17,
                 from /usr/src/linux/include/linux/binfmts.h:5,
                 from /usr/src/linux/include/linux/sched.h:9,
                 from /usr/src/linux/include/linux/mm.h:4,
                 from /usr/src/linux/include/linux/slab.h:14,
                 from /usr/src/linux/include/linux/proc_fs.h:5,
                 from init/main.c:15:
/usr/src/linux/include/asm/processor.h:72: error: array type has incomplete element type
In file included from /usr/src/linux/include/linux/fs.h:199,
                 from /usr/src/linux/include/linux/capability.h:17,
                 from /usr/src/linux/include/linux/binfmts.h:5,
                 from /usr/src/linux/include/linux/sched.h:9,
                 from /usr/src/linux/include/linux/mm.h:4,
                 from /usr/src/linux/include/linux/slab.h:14,
                 from /usr/src/linux/include/linux/proc_fs.h:5,
                 from init/main.c:15:
/usr/src/linux/include/asm/byteorder.h:14: warning: type qualifiers ignored on function return type
/usr/src/linux/include/asm/byteorder.h:28: warning: type qualifiers ignored on function return type
In file included from /usr/src/linux/include/linux/byteorder/little_endian.h:11,
                 from /usr/src/linux/include/asm/byteorder.h:45,
                 from /usr/src/linux/include/linux/fs.h:199,
                 from /usr/src/linux/include/linux/capability.h:17,
                 from /usr/src/linux/include/linux/binfmts.h:5,
                 from /usr/src/linux/include/linux/sched.h:9,
                 from /usr/src/linux/include/linux/mm.h:4,
                 from /usr/src/linux/include/linux/slab.h:14,
                 from /usr/src/linux/include/linux/proc_fs.h:5,
                 from init/main.c:15:
/usr/src/linux/include/linux/byteorder/swab.h:132: warning: type qualifiers ignored on function return type
/usr/src/linux/include/linux/byteorder/swab.h:145: warning: type qualifiers ignored on function return type
/usr/src/linux/include/linux/byteorder/swab.h:159: warning: type qualifiers ignored on function return type
In file included from /usr/src/linux/include/linux/fs.h:308,
                 from /usr/src/linux/include/linux/capability.h:17,
                 from /usr/src/linux/include/linux/binfmts.h:5,
                 from /usr/src/linux/include/linux/sched.h:9,
                 from /usr/src/linux/include/linux/mm.h:4,
                 from /usr/src/linux/include/linux/slab.h:14,
                 from /usr/src/linux/include/linux/proc_fs.h:5,
                 from init/main.c:15:
/usr/src/linux/include/linux/ncp_fs_i.h:26: warning: ‘packed’ attribute ignored for field of type ‘__u8’
/usr/src/linux/include/linux/ncp_fs_i.h:27: warning: ‘packed’ attribute ignored for field of type ‘__u8[6]’
In file included from /usr/src/linux/include/linux/ncp_mount.h:12,
                 from /usr/src/linux/include/linux/ncp_fs_sb.h:12,
                 from /usr/src/linux/include/linux/fs.h:660,
                 from /usr/src/linux/include/linux/capability.h:17,
                 from /usr/src/linux/include/linux/binfmts.h:5,
                 from /usr/src/linux/include/linux/sched.h:9,
                 from /usr/src/linux/include/linux/mm.h:4,
                 from /usr/src/linux/include/linux/slab.h:14,
                 from /usr/src/linux/include/linux/proc_fs.h:5,
                 from init/main.c:15:
/usr/src/linux/include/linux/ncp.h:24: warning: ‘packed’ attribute ignored for field of type ‘__u8’
/usr/src/linux/include/linux/ncp.h:25: warning: ‘packed’ attribute ignored for field of type ‘__u8’
/usr/src/linux/include/linux/ncp.h:26: warning: ‘packed’ attribute ignored for field of type ‘__u8’
/usr/src/linux/include/linux/ncp.h:27: warning: ‘packed’ attribute ignored for field of type ‘__u8’
/usr/src/linux/include/linux/ncp.h:28: warning: ‘packed’ attribute ignored for field of type ‘__u8’
/usr/src/linux/include/linux/ncp.h:29: warning: ‘packed’ attribute ignored for field of type ‘__u8[]’
/usr/src/linux/include/linux/ncp.h:37: warning: ‘packed’ attribute ignored for field of type ‘__u8’
/usr/src/linux/include/linux/ncp.h:38: warning: ‘packed’ attribute ignored for field of type ‘__u8’
/usr/src/linux/include/linux/ncp.h:39: warning: ‘packed’ attribute ignored for field of type ‘__u8’
/usr/src/linux/include/linux/ncp.h:40: warning: ‘packed’ attribute ignored for field of type ‘__u8’
/usr/src/linux/include/linux/ncp.h:41: warning: ‘packed’ attribute ignored for field of type ‘__u8’
/usr/src/linux/include/linux/ncp.h:42: warning: ‘packed’ attribute ignored for field of type ‘__u8’
/usr/src/linux/include/linux/ncp.h:43: warning: ‘packed’ attribute ignored for field of type ‘__u8[]’
/usr/src/linux/include/linux/ncp.h:137: warning: ‘packed’ attribute ignored for field of type ‘__u8’
/usr/src/linux/include/linux/ncp.h:138: warning: ‘packed’ attribute ignored for field of type ‘__u8[256]’
/usr/src/linux/include/linux/ncp.h:174: warning: ‘packed’ attribute ignored for field of type ‘__u8’
In file included from /usr/src/linux/include/asm/smp.h:17,
                 from /usr/src/linux/include/linux/smp.h:14,
                 from /usr/src/linux/include/linux/sched.h:23,
                 from /usr/src/linux/include/linux/mm.h:4,
                 from /usr/src/linux/include/linux/slab.h:14,
                 from /usr/src/linux/include/linux/proc_fs.h:5,
                 from init/main.c:15:
/usr/src/linux/include/asm/mpspec.h:79: warning: ‘packed’ attribute ignored for field of type ‘unsigned char[6]’
In file included from /usr/src/linux/include/linux/sched.h:23,
                 from /usr/src/linux/include/linux/mm.h:4,
                 from /usr/src/linux/include/linux/slab.h:14,
                 from /usr/src/linux/include/linux/proc_fs.h:5,
                 from init/main.c:15:
/usr/src/linux/include/linux/smp.h:29: error: conflicting types for ‘smp_send_reschedule’
/usr/src/linux/include/asm/smp.h:39: error: previous declaration of ‘smp_send_reschedule’ was here
In file included from /usr/src/linux/include/linux/unistd.h:9,
                 from init/main.c:17:
/usr/src/linux/include/asm/unistd.h:345: warning: conflicting types for built-in function ‘_exit’
In file included from /usr/src/linux/include/linux/netdevice.h:146,
                 from /usr/src/linux/include/net/ip.h:29,
                 from /usr/src/linux/include/net/checksum.h:31,
                 from /usr/src/linux/include/linux/raid/md.h:34,
                 from init/main.c:24:
/usr/src/linux/include/linux/skbuff.h: In function ‘__skb_pull’:
/usr/src/linux/include/linux/skbuff.h:828: warning: pointer targets in return differ in signedness
/usr/src/linux/include/linux/skbuff.h: In function ‘skb_pull’:
/usr/src/linux/include/linux/skbuff.h:846: warning: pointer targets in return differ in signedness
/usr/src/linux/include/linux/skbuff.h: In function ‘__pskb_pull’:
/usr/src/linux/include/linux/skbuff.h:857: warning: pointer targets in return differ in signedness
/usr/src/linux/include/linux/skbuff.h: In function ‘pskb_pull’:
/usr/src/linux/include/linux/skbuff.h:864: warning: pointer targets in return differ in signedness
In file included from /usr/src/linux/include/net/sock.h:87,
                 from /usr/src/linux/include/net/ip.h:39,
                 from /usr/src/linux/include/net/checksum.h:31,
                 from /usr/src/linux/include/linux/raid/md.h:34,
                 from init/main.c:24:
/usr/src/linux/include/linux/atalk.h: At top level:
/usr/src/linux/include/linux/atalk.h:140: warning: ‘packed’ attribute ignored for field of type ‘__u8[6]’
/usr/src/linux/include/linux/atalk.h:141: warning: ‘packed’ attribute ignored for field of type ‘__u8’
/usr/src/linux/include/linux/atalk.h:143: warning: ‘packed’ attribute ignored for field of type ‘__u8’
/usr/src/linux/include/linux/atalk.h:144: warning: ‘packed’ attribute ignored for field of type ‘__u8[6]’
/usr/src/linux/include/linux/atalk.h:145: warning: ‘packed’ attribute ignored for field of type ‘__u8’
/usr/src/linux/include/linux/atalk.h:147: warning: ‘packed’ attribute ignored for field of type ‘__u8’
In file included from /usr/src/linux/include/net/checksum.h:33,
                 from /usr/src/linux/include/linux/raid/md.h:34,
                 from init/main.c:24:
/usr/src/linux/include/asm/checksum.h: In function ‘ip_fast_csum’:
/usr/src/linux/include/asm/checksum.h:72: error: missing terminating " character
/usr/src/linux/include/asm/checksum.h:73: error: expected string literal before ‘movl’
In file included from /usr/src/linux/include/net/checksum.h:33,
                 from /usr/src/linux/include/linux/raid/md.h:34,
                 from init/main.c:24:
/usr/src/linux/include/asm/checksum.h:75:10: error: invalid suffix "f" on integer constant
/usr/src/linux/include/asm/checksum.h:82:10: error: invalid suffix "b" on integer constant
/usr/src/linux/include/asm/checksum.h:90: error: missing terminating " character
/usr/src/linux/include/asm/checksum.h: In function ‘csum_fold’:
/usr/src/linux/include/asm/checksum.h:105: error: missing terminating " character
/usr/src/linux/include/asm/checksum.h:106: error: expected string literal before ‘addl’
/usr/src/linux/include/asm/checksum.h:108: error: missing terminating " character
/usr/src/linux/include/asm/checksum.h: In function ‘csum_tcpudp_nofold’:
/usr/src/linux/include/asm/checksum.h:121: error: missing terminating " character
/usr/src/linux/include/asm/checksum.h:122: error: expected string literal before ‘addl’
/usr/src/linux/include/asm/checksum.h:126: error: missing terminating " character
/usr/src/linux/include/asm/checksum.h: In function ‘csum_ipv6_magic’:
/usr/src/linux/include/asm/checksum.h:161: error: missing terminating " character
/usr/src/linux/include/asm/checksum.h:162: error: expected string literal before ‘addl’
/usr/src/linux/include/asm/checksum.h:173: error: missing terminating " character
make[1]: *** [init/main.o] Error 1
make[1]: Leaving directory `/usr/src/linux'
make: *** [debian/stamp-build-kernel] Error 2


qualcuno può aiutarmi???
Avatar utente
vader
Neo Iscritto
Neo Iscritto
 
Messaggi: 8
Iscritto il: dom dic 16, 2007 10:18 am

Messaggioda ninjabionico » sab dic 22, 2007 3:03 pm

Ciao,

prova così, da terminale digita:

Codice: Seleziona tutto
sudo -s
cd /usr/src/linux
make menuconfig
make dep
make clean
make bzImage
make modules
make modules_install


Fammi sapere se e quali errori ti escono.

Se non vedi errori, il file /usr/src/linux/arch/i386/boot/bzImage è il nuovo kernel compilato.

Dovrai quindi copiarlo in /boot rinominandolo, quindi riconfigurare Grub perché ti carichi il nuovo kernel all'avvio.

Ciao.
Io dico le cose così come stanno! Questo è il mio credo ninja - by Naruto Uzumaki
Expert-Advanced User Powered by Gnu/Linux
Avatar utente
ninjabionico
Membro Ufficiale (Gold)
Membro Ufficiale (Gold)
 
Messaggi: 5207
Iscritto il: lun mar 20, 2006 10:51 pm
Località: Prov. Pd

Messaggioda vader » sab dic 22, 2007 8:03 pm

root@mars:/usr/src/linux# make bzImage
scripts/split-include include/linux/autoconf.h include/config
gcc -D__KERNEL__ -I/usr/src/linux/include -Wall -Wstrict-prototypes -Wno-trigraphs -O2 -fomit-frame-pointer -fno-strict-aliasing -fno-common -pipe -mpreferred-stack-boundary=2 -march=i586 -c -o init/main.o init/main.c
In file included from /usr/src/linux/include/linux/wait.h:19,
from /usr/src/linux/include/linux/fs.h:12,
from /usr/src/linux/include/linux/capability.h:17,
from /usr/src/linux/include/linux/binfmts.h:5,
from /usr/src/linux/include/linux/sched.h:9,
from /usr/src/linux/include/linux/mm.h:4,
from /usr/src/linux/include/linux/slab.h:14,
from /usr/src/linux/include/linux/proc_fs.h:5,
from init/main.c:15:
/usr/src/linux/include/asm/processor.h:72: error: array type has incomplete element type
In file included from /usr/src/linux/include/linux/fs.h:199,
from /usr/src/linux/include/linux/capability.h:17,
from /usr/src/linux/include/linux/binfmts.h:5,
from /usr/src/linux/include/linux/sched.h:9,
from /usr/src/linux/include/linux/mm.h:4,
from /usr/src/linux/include/linux/slab.h:14,
from /usr/src/linux/include/linux/proc_fs.h:5,
from init/main.c:15:
/usr/src/linux/include/asm/byteorder.h:14: warning: type qualifiers ignored on function return type
/usr/src/linux/include/asm/byteorder.h:28: warning: type qualifiers ignored on function return type
In file included from /usr/src/linux/include/linux/byteorder/little_endian.h:11,
from /usr/src/linux/include/asm/byteorder.h:45,
from /usr/src/linux/include/linux/fs.h:199,
from /usr/src/linux/include/linux/capability.h:17,
from /usr/src/linux/include/linux/binfmts.h:5,
from /usr/src/linux/include/linux/sched.h:9,
from /usr/src/linux/include/linux/mm.h:4,
from /usr/src/linux/include/linux/slab.h:14,
from /usr/src/linux/include/linux/proc_fs.h:5,
from init/main.c:15:
/usr/src/linux/include/linux/byteorder/swab.h:132: warning: type qualifiers ignored on function return type
/usr/src/linux/include/linux/byteorder/swab.h:145: warning: type qualifiers ignored on function return type
/usr/src/linux/include/linux/byteorder/swab.h:159: warning: type qualifiers ignored on function return type
In file included from /usr/src/linux/include/linux/fs.h:308,
from /usr/src/linux/include/linux/capability.h:17,
from /usr/src/linux/include/linux/binfmts.h:5,
from /usr/src/linux/include/linux/sched.h:9,
from /usr/src/linux/include/linux/mm.h:4,
from /usr/src/linux/include/linux/slab.h:14,
from /usr/src/linux/include/linux/proc_fs.h:5,
from init/main.c:15:
/usr/src/linux/include/linux/ncp_fs_i.h:26: warning: ‘packed’ attribute ignored for field of type ‘__u8’
/usr/src/linux/include/linux/ncp_fs_i.h:27: warning: ‘packed’ attribute ignored for field of type ‘__u8[6]’
In file included from /usr/src/linux/include/linux/ncp_mount.h:12,
from /usr/src/linux/include/linux/ncp_fs_sb.h:12,
from /usr/src/linux/include/linux/fs.h:660,
from /usr/src/linux/include/linux/capability.h:17,
from /usr/src/linux/include/linux/binfmts.h:5,
from /usr/src/linux/include/linux/sched.h:9,
from /usr/src/linux/include/linux/mm.h:4,
from /usr/src/linux/include/linux/slab.h:14,
from /usr/src/linux/include/linux/proc_fs.h:5,
from init/main.c:15:
/usr/src/linux/include/linux/ncp.h:24: warning: ‘packed’ attribute ignored for field of type ‘__u8’
/usr/src/linux/include/linux/ncp.h:25: warning: ‘packed’ attribute ignored for field of type ‘__u8’
/usr/src/linux/include/linux/ncp.h:26: warning: ‘packed’ attribute ignored for field of type ‘__u8’
/usr/src/linux/include/linux/ncp.h:27: warning: ‘packed’ attribute ignored for field of type ‘__u8’
/usr/src/linux/include/linux/ncp.h:28: warning: ‘packed’ attribute ignored for field of type ‘__u8’
/usr/src/linux/include/linux/ncp.h:29: warning: ‘packed’ attribute ignored for field of type ‘__u8[]’
/usr/src/linux/include/linux/ncp.h:37: warning: ‘packed’ attribute ignored for field of type ‘__u8’
/usr/src/linux/include/linux/ncp.h:38: warning: ‘packed’ attribute ignored for field of type ‘__u8’
/usr/src/linux/include/linux/ncp.h:39: warning: ‘packed’ attribute ignored for field of type ‘__u8’
/usr/src/linux/include/linux/ncp.h:40: warning: ‘packed’ attribute ignored for field of type ‘__u8’
/usr/src/linux/include/linux/ncp.h:41: warning: ‘packed’ attribute ignored for field of type ‘__u8’
/usr/src/linux/include/linux/ncp.h:42: warning: ‘packed’ attribute ignored for field of type ‘__u8’
/usr/src/linux/include/linux/ncp.h:43: warning: ‘packed’ attribute ignored for field of type ‘__u8[]’
/usr/src/linux/include/linux/ncp.h:137: warning: ‘packed’ attribute ignored for field of type ‘__u8’
/usr/src/linux/include/linux/ncp.h:138: warning: ‘packed’ attribute ignored for field of type ‘__u8[256]’
/usr/src/linux/include/linux/ncp.h:174: warning: ‘packed’ attribute ignored for field of type ‘__u8’
In file included from /usr/src/linux/include/asm/smp.h:17,
from /usr/src/linux/include/linux/smp.h:14,
from /usr/src/linux/include/linux/sched.h:23,
from /usr/src/linux/include/linux/mm.h:4,
from /usr/src/linux/include/linux/slab.h:14,
from /usr/src/linux/include/linux/proc_fs.h:5,
from init/main.c:15:
/usr/src/linux/include/asm/mpspec.h:79: warning: ‘packed’ attribute ignored for field of type ‘unsigned char[6]’
In file included from /usr/src/linux/include/linux/sched.h:23,
from /usr/src/linux/include/linux/mm.h:4,
from /usr/src/linux/include/linux/slab.h:14,
from /usr/src/linux/include/linux/proc_fs.h:5,
from init/main.c:15:
/usr/src/linux/include/linux/smp.h:29: error: conflicting types for ‘smp_send_reschedule’
/usr/src/linux/include/asm/smp.h:39: error: previous declaration of ‘smp_send_reschedule’ was here
In file included from /usr/src/linux/include/linux/unistd.h:9,
from init/main.c:17:
/usr/src/linux/include/asm/unistd.h:345: warning: conflicting types for built-in function ‘_exit’
In file included from /usr/src/linux/include/linux/netdevice.h:146,
from /usr/src/linux/include/net/ip.h:29,
from /usr/src/linux/include/net/checksum.h:31,
from /usr/src/linux/include/linux/raid/md.h:34,
from init/main.c:24:
/usr/src/linux/include/linux/skbuff.h: In function ‘__skb_pull’:
/usr/src/linux/include/linux/skbuff.h:828: warning: pointer targets in return differ in signedness
/usr/src/linux/include/linux/skbuff.h: In function ‘skb_pull’:
/usr/src/linux/include/linux/skbuff.h:846: warning: pointer targets in return differ in signedness
/usr/src/linux/include/linux/skbuff.h: In function ‘__pskb_pull’:
/usr/src/linux/include/linux/skbuff.h:857: warning: pointer targets in return differ in signedness
/usr/src/linux/include/linux/skbuff.h: In function ‘pskb_pull’:
/usr/src/linux/include/linux/skbuff.h:864: warning: pointer targets in return differ in signedness
In file included from /usr/src/linux/include/net/sock.h:87,
from /usr/src/linux/include/net/ip.h:39,
from /usr/src/linux/include/net/checksum.h:31,
from /usr/src/linux/include/linux/raid/md.h:34,
from init/main.c:24:
/usr/src/linux/include/linux/atalk.h: At top level:
/usr/src/linux/include/linux/atalk.h:140: warning: ‘packed’ attribute ignored for field of type ‘__u8[6]’
/usr/src/linux/include/linux/atalk.h:141: warning: ‘packed’ attribute ignored for field of type ‘__u8’
/usr/src/linux/include/linux/atalk.h:143: warning: ‘packed’ attribute ignored for field of type ‘__u8’
/usr/src/linux/include/linux/atalk.h:144: warning: ‘packed’ attribute ignored for field of type ‘__u8[6]’
/usr/src/linux/include/linux/atalk.h:145: warning: ‘packed’ attribute ignored for field of type ‘__u8’
/usr/src/linux/include/linux/atalk.h:147: warning: ‘packed’ attribute ignored for field of type ‘__u8’
In file included from /usr/src/linux/include/net/checksum.h:33,
from /usr/src/linux/include/linux/raid/md.h:34,
from init/main.c:24:
/usr/src/linux/include/asm/checksum.h: In function ‘ip_fast_csum’:
/usr/src/linux/include/asm/checksum.h:72: error: missing terminating " character
/usr/src/linux/include/asm/checksum.h:73: error: expected string literal before ‘movl’
In file included from /usr/src/linux/include/net/checksum.h:33,
from /usr/src/linux/include/linux/raid/md.h:34,
from init/main.c:24:
/usr/src/linux/include/asm/checksum.h:75:10: error: invalid suffix "f" on integer constant
/usr/src/linux/include/asm/checksum.h:82:10: error: invalid suffix "b" on integer constant
/usr/src/linux/include/asm/checksum.h:90: error: missing terminating " character
/usr/src/linux/include/asm/checksum.h: In function ‘csum_fold’:
/usr/src/linux/include/asm/checksum.h:105: error: missing terminating " character
/usr/src/linux/include/asm/checksum.h:106: error: expected string literal before ‘addl’
/usr/src/linux/include/asm/checksum.h:108: error: missing terminating " character
/usr/src/linux/include/asm/checksum.h: In function ‘csum_tcpudp_nofold’:
/usr/src/linux/include/asm/checksum.h:121: error: missing terminating " character
/usr/src/linux/include/asm/checksum.h:122: error: expected string literal before ‘addl’
/usr/src/linux/include/asm/checksum.h:126: error: missing terminating " character
/usr/src/linux/include/asm/checksum.h: In function ‘csum_ipv6_magic’:
/usr/src/linux/include/asm/checksum.h:161: error: missing terminating " character
/usr/src/linux/include/asm/checksum.h:162: error: expected string literal before ‘addl’
/usr/src/linux/include/asm/checksum.h:173: error: missing terminating " character
make: *** [init/main.o] Error 1
Avatar utente
vader
Neo Iscritto
Neo Iscritto
 
Messaggi: 8
Iscritto il: dom dic 16, 2007 10:18 am


Messaggioda ninjabionico » sab dic 22, 2007 9:51 pm

Ciao.

L'errore si nota subito fin dall'inizio, sul processore.

Quando hai eseguito make menuconfig, hai selezionato correttamente le varie voci del kernel?

Se hai seguito la guida di cui hai postato il link, probabilmente il file di configurazione è errato, la configurazione dei kernel cambia di versione in versione, di solito si recupera quella della versione vecchia con il nuovo, tu hai fatto l'opposto, poi tra due versioni completamente diverse, la 2.6 e la 2.4, è come cercare di adattare la configurazione di windows Xp al 98, sono due sistemi completamente diversi.

Quindi esegui il comando make menuconfig e configura partendo da 0 il tuo kernel. Una volta completata la configurazione, riprova a compilarlo.

Ciao.
Io dico le cose così come stanno! Questo è il mio credo ninja - by Naruto Uzumaki
Expert-Advanced User Powered by Gnu/Linux
Avatar utente
ninjabionico
Membro Ufficiale (Gold)
Membro Ufficiale (Gold)
 
Messaggi: 5207
Iscritto il: lun mar 20, 2006 10:51 pm
Località: Prov. Pd

Messaggioda vader » dom dic 23, 2007 10:46 am

ninjabionico ha scritto:Ciao.

L'errore si nota subito fin dall'inizio, sul processore.

Quando hai eseguito make menuconfig, hai selezionato correttamente le varie voci del kernel?

Se hai seguito la guida di cui hai postato il link, probabilmente il file di configurazione è errato, la configurazione dei kernel cambia di versione in versione, di solito si recupera quella della versione vecchia con il nuovo, tu hai fatto l'opposto, poi tra due versioni completamente diverse, la 2.6 e la 2.4, è come cercare di adattare la configurazione di windows Xp al 98, sono due sistemi completamente diversi.

Quindi esegui il comando make menuconfig e configura partendo da 0 il tuo kernel. Una volta completata la configurazione, riprova a compilarlo.

Ciao.

Intanto grazie mille per la risposta.
Non ho mai usato questa procedura, quindi in menuconfig non ho toccato niente, puoi darmi qlc dritta?
grazie ancora
Avatar utente
vader
Neo Iscritto
Neo Iscritto
 
Messaggi: 8
Iscritto il: dom dic 16, 2007 10:18 am

Messaggioda ninjabionico » dom dic 23, 2007 2:54 pm

Ciao.

Stavo per farti una piccola guida, quando mi sono detto, vuoi vedere che qualcuno non l'ha già fatta?

Con un piccola ricerca sono giunto a questa, è molto bella...

http://guide.debianizzati.org/index.php ... rnel_Howto

... e molto completa, c'è un bel link ad un esempio di configurazione:

http://guide.debianizzati.org/index.php ... one_kernel

Ciao.
Io dico le cose così come stanno! Questo è il mio credo ninja - by Naruto Uzumaki
Expert-Advanced User Powered by Gnu/Linux
Avatar utente
ninjabionico
Membro Ufficiale (Gold)
Membro Ufficiale (Gold)
 
Messaggi: 5207
Iscritto il: lun mar 20, 2006 10:51 pm
Località: Prov. Pd


Torna a Distribuzioni, Kernel e Software Applicativo

Chi c’è in linea

Visitano il forum: Nessuno e 0 ospiti

Powered by phpBB © 2002, 2005, 2007, 2008 phpBB Group
Traduzione Italiana phpBB.it

megalab.it: testata telematica quotidiana registrata al Tribunale di Cosenza n. 22/09 del 13.08.2009, editore Master New Media S.r.l.; © Copyright 2008 Master New Media S.r.l. a socio unico - P.I. 02947530784. GRUPPO EDIZIONI MASTER Spa Tutti i diritti sono riservati. Per la pubblicità: Master Advertising